BDBM50418097 CHEMBL1743342
SMILES CNCCCC(C#N)(C(C)C)c1ccc(OC)c(OC)c1
InChI Key InChIKey=WLOBUUJURNEQCL-UHFFFAOYSA-N
Data  1 KI
  Tab Delimited (TSV)   2D SDfile   Computed 3D by Vconf -m prep SDfile
Find this compound or compounds like it in BindingDB:
Activity Spreadsheet -- Enzyme Inhibition Constant Data from BindingDB
Found 1 hit for monomerid = 50418097
TargetCytochrome P450 3A4(Homo sapiens (Human))
F. Hoffmann-La Roche
Curated by ChEMBL
LigandPNGBDBM50418097(CHEMBL1743342)
Affinity DataKi:  7.93E+3nM. Assay description: Mechanism based inhibition of human cytochrome P450 3A4 measured by testosterone 6-beta hydroxylation
In DepthDetails ArticlePubMed