BDBM50418098 CHEMBL1743354
SMILES CCN(CC1CCN(CC1)S(C)(=O)=O)[C@@H](C)Cc1ccc2OCCc2c1
InChI Key InChIKey=DUHKKBBESXCBNM-INIZCTEOSA-N
Data  1 KI
  Tab Delimited (TSV)   2D SDfile   Computed 3D by Vconf -m prep SDfile
Find this compound or compounds like it in BindingDB:
Activity Spreadsheet -- Enzyme Inhibition Constant Data from BindingDB
Found 1 hit for monomerid = 50418098
TargetCytochrome P450 2D6(Homo sapiens (Human))
F. Hoffmann-La Roche
Curated by ChEMBL
LigandPNGBDBM50418098(CHEMBL1743354)
Affinity DataKi:  1.42E+3nM. Assay description: Mechanism based inhibition of human cytochrome P450 2D6 measured by bufurarol hydroxylation using liver microsomes
In DepthDetails ArticlePubMed