BDBM50418118 CHEMBL1762816
SMILES CC(C)N(CCO)Cc1nc(sc1Cl)-c1cn(CC2CCOCC2)c2c(Cl)cccc12
InChI Key InChIKey=LUTXPPYCQADQQH-UHFFFAOYSA-N
Data  1 KI
  Tab Delimited (TSV)   2D SDfile   Computed 3D by Vconf -m prep SDfile
Find this compound or compounds like it in BindingDB:
Activity Spreadsheet -- Enzyme Inhibition Constant Data from BindingDB
Found 1 hit for monomerid = 50418118
TargetPotassium voltage-gated channel subfamily H member 2(Homo sapiens (Human))
Merck Research Laboratories
Curated by ChEMBL
LigandPNGBDBM50418118(CHEMBL1762816)
Affinity DataKi:  631nM. Assay description: Displacement of [3H]-dofetilide from human ERG expressed in HEK293 cells
In DepthDetails ArticlePubMed