BDBM50418201 CHEMBL1761701
SMILES CC(C)[C@@H](CO)NCc1c(noc1-c1ccc(cc1)C(F)(F)F)C(=O)N[C@@H]1CCC[C@H](O)C1
InChI Key InChIKey=BJXXTUUHHKNKSP-ZIFCJYIRSA-N
Data  1 IC50
  Tab Delimited (TSV)   2D SDfile   Computed 3D by Vconf -m prep SDfile
Find this compound or compounds like it in BindingDB:
Activity Spreadsheet -- Enzyme Inhibition Constant Data from BindingDB
Found 1 hit for monomerid = 50418201
LigandPNGBDBM50418201(CHEMBL1761701)
Affinity DataIC50:  10nM. Assay description: Antagonist activity at human TRPV1 expressed in CHO-K1 cells assessed as inhibition of capsaicin-induced intracellular Ca2+ influx by FLIPR assay
In DepthDetails ArticlePubMed