BDBM50419183 CHEMBL1831045
SMILES CC(C)(C)C(N)\C=C\c1ccc(Cl)cc1Cl
InChI Key InChIKey=IEJVKGOCPPYGHN-FNORWQNLSA-N
Data  1 KI
  Tab Delimited (TSV)   2D SDfile   Computed 3D by Vconf -m prep SDfile
Find this compound or compounds like it in BindingDB:
Activity Spreadsheet -- Enzyme Inhibition Constant Data from BindingDB
Found 1 hit for monomerid = 50419183
TargetAcetylcholine-binding protein(Lymnaea stagnalis)
Vu University Amsterdam
Curated by ChEMBL
LigandPNGBDBM50419183(CHEMBL1831045)
Affinity DataKi:  1.26E+4nM. Assay description: Displacement of [3H]-epibatidine from histidine-tagged Lymnaea stagnalis AChBP expressed in Sf9 cells after 1.5 hrs by liquid scintillation counting
In DepthDetails ArticlePubMed