BDBM50419188 CHEMBL1616460
SMILES C(N1CCCC1)c1ccccc1Sc1ccccc1
InChI Key InChIKey=YPHHLMXERAEIAI-UHFFFAOYSA-N
Data  2 KI
  Tab Delimited (TSV)   2D SDfile   Computed 3D by Vconf -m prep SDfile
Find this compound or compounds like it in BindingDB:
Activity Spreadsheet -- Enzyme Inhibition Constant Data from BindingDB
Found 2 hits for monomerid = 50419188
TargetAcetylcholine-binding protein(Lymnaea stagnalis)
Vu University Amsterdam
Curated by ChEMBL
LigandPNGBDBM50419188(CHEMBL1616460)
Affinity DataKi:  200nM. Assay description: Displacement of [3H]-epibatidine from histidine-tagged Lymnaea stagnalis AChBP expressed in Sf9 cells after 1.5 hrs by liquid scintillation counting
In DepthDetails ArticlePubMed
TargetNeuronal acetylcholine receptor subunit alpha-7(Homo sapiens (Human))
Vu University Amsterdam
Curated by ChEMBL
LigandPNGBDBM50419188(CHEMBL1616460)
Affinity DataKi:  1.58E+4nM. Assay description: Displacement of [3H]-MLA from human alpha7 nAChR expressed in human SH-SY5Y cells after 1.5 hrs by liquid scintillation counting
In DepthDetails ArticlePubMed