BDBM50419554 CHEMBL1929429
SMILES CC1(C)CCCN(CCNc2nccs2)C1
InChI Key InChIKey=LTXRNGCCLHOAEL-UHFFFAOYSA-N
Data  2 KI
  Tab Delimited (TSV)   2D SDfile   Computed 3D by Vconf -m prep SDfile
Find this compound or compounds like it in BindingDB:
Activity Spreadsheet -- Enzyme Inhibition Constant Data from BindingDB
Found 2 hits for monomerid = 50419554
TargetSigma non-opioid intracellular receptor 1(Cavia porcellus (Guinea pig))
Universit£
Curated by ChEMBL
LigandPNGBDBM50419554(CHEMBL1929429)
Affinity DataKi:  459nM. Assay description: Displacement of [3H]-(+)-pentazocine from sigma1 receptor in guinea pig brain membranes without cerebellum
In DepthDetails ArticlePubMed
Target3-beta-hydroxysteroid-Delta(8),Delta(7)-isomerase(Cavia porcellus)
Universit£
Curated by ChEMBL
LigandPNGBDBM50419554(CHEMBL1929429)
Affinity DataKi:  1.40E+3nM. Assay description: Displacement of [3H]-emopamil from delta(8)-delta(7) sterol isomerase in guinea pig liver membranes
In DepthDetails ArticlePubMed