BDBM50419770 CHEMBL1950035
SMILES CCNC(=O)c1ccc2OCCc3cc(sc3-c2c1)C(=O)N(C)c1ccccc1Cl
InChI Key InChIKey=UNOKQMHGASWYJJ-UHFFFAOYSA-N
Data  2 KI
  Tab Delimited (TSV)   2D SDfile   Computed 3D by Vconf -m prep SDfile
Find this compound or compounds like it in BindingDB:
Activity Spreadsheet -- Enzyme Inhibition Constant Data from BindingDB
Found 2 hits for monomerid = 50419770
LigandPNGBDBM50419770(CHEMBL1950035)
Affinity DataKi:  1nM. Assay description: Apparent binding affinity to PI3Kalpha using PIP3 as substrate after 30 mins by fluorescence polarization assay
In DepthDetails ArticlePubMed
LigandPNGBDBM50419770(CHEMBL1950035)
Affinity DataKi:  55nM. Assay description: Apparent binding affinity to PI3Kbeta using PIP3 as substrate after 30 mins by fluorescence polarization assay
In DepthDetails ArticlePubMed