BDBM50420066 CHEMBL2046683
SMILES Fc1cc(ccc1C(F)(F)F)C(=O)Nc1ccc(Cl)nc1
InChI Key InChIKey=XXQQNUNEGMOWCU-UHFFFAOYSA-N
Data  1 IC50  1 EC50
  Tab Delimited (TSV)   2D SDfile   Computed 3D by Vconf -m prep SDfile
Find this compound or compounds like it in BindingDB:
Activity Spreadsheet -- Enzyme Inhibition Constant Data from BindingDB
Found 2 hits for monomerid = 50420066
TargetPotassium voltage-gated channel subfamily E/KQT member 1(Homo sapiens (Human))
TBA
Curated by ChEMBL
LigandPNGBDBM50420066(CHEMBL2046683)
Affinity DataIC50:  3.40E+3nM. Assay description: Antagonist activity at KCNQ1/MINK expressed in CHO cells assessed as inhibition of KCl-induced 86Rb+ efflux incubated for 10 mins prior to KCl-induct...
In DepthDetails ArticlePubMed
TargetPotassium voltage-gated channel subfamily KQT member 2/3(Homo sapiens (Human))
TBA
Curated by ChEMBL
LigandPNGBDBM50420066(CHEMBL2046683)
Affinity DataEC50:  370nM. Assay description: Agonist activity at KCNQ2/KCNQ3 expressed in CHO cells assessed as increase in KCl-induced 86Rb+ efflux incubated for 10 mins prior to KCl-induction ...
In DepthDetails ArticlePubMed