BDBM50420203 CHEMBL2074983
SMILES N[C@@H](CSc1nc2ccccc2s1)C(O)=O
InChI Key InChIKey=KRBPTLCTECPKGY-LURJTMIESA-N
Data  1 IC50
  Tab Delimited (TSV)   2D SDfile   Computed 3D by Vconf -m prep SDfile
Find this compound or compounds like it in BindingDB:
Activity Spreadsheet -- Enzyme Inhibition Constant Data from BindingDB
Found 1 hit for monomerid = 50420203
TargetSolute carrier family 22 member 6(Homo sapiens (Human))
University Of Arizona
Curated by ChEMBL
LigandPNGBDBM50420203(CHEMBL2074983)
Affinity DataIC50:  9.90E+3nM. Assay description: TP_TRANSPORTER: inhibition of PAH uptake in OAT1-expressing CHO cells
In DepthDetails ArticlePubMed