BDBM50420345 CHEMBL2089171
SMILES CC(C)C[C@H](NC(=O)[C@@H](N)Cc1ccccc1)C(=O)N[C@@H](Cc1ccc(O)cc1)C(=O)NO
InChI Key InChIKey=NMHCQKUAHBPADP-ACRUOGEOSA-N
Data  1 IC50
  Tab Delimited (TSV)   2D SDfile   Computed 3D by Vconf -m prep SDfile
Find this compound or compounds like it in BindingDB:
Activity Spreadsheet -- Enzyme Inhibition Constant Data from BindingDB
Found 1 hit for monomerid = 50420345
TargetSnake venom metalloproteinase BaP1(Bothrops asper)
TBA
Curated by ChEMBL
LigandPNGBDBM50420345(CHEMBL2089171)
Affinity DataIC50:  3.09E+4nM. Assay description: Inhibition of snake venom BaP1 using Abz-Ala-Gly-Leu-Ala-Nba as substrate incubated for 30 mins prior to substrate addition by fluorescence spectroph...
In DepthDetails ArticlePubMed