BDBM50420399 CHEMBL2089253
SMILES CCOc1nc(Nc2ccccc2)cc(N)c1C#N
InChI Key InChIKey=SDLRWVPQOBBMSJ-UHFFFAOYSA-N
Data  2 IC50
  Tab Delimited (TSV)   2D SDfile   Computed 3D by Vconf -m prep SDfile
Find this compound or compounds like it in BindingDB:
Activity Spreadsheet -- Enzyme Inhibition Constant Data from BindingDB
Found 2 hits for monomerid = 50420399
TargetMitogen-activated protein kinase 8(Homo sapiens (Human))
TBA
Curated by ChEMBL
LigandPNGBDBM50420399(CHEMBL2089253)
Affinity DataIC50:  1.04E+3nM. Assay description: Inhibition of JNK1-mediated ATF2 phosphorylation after 1 hr by ELISA
In DepthDetails ArticlePubMed
Target40S ribosomal protein S27(Homo sapiens (Human))
TBA
Curated by ChEMBL
LigandPNGBDBM50420399(CHEMBL2089253)
Affinity DataIC50:  228nM. Assay description: Inhibition of Mps1-mediated p38 MAPK phosphorylation after 90 mins by DELFIA assay
In DepthDetails ArticlePubMed