BDBM50420412 CHEMBL2089328
SMILES Nc1nc2nc(cnc2c(=O)[nH]1)C(=O)NCc1cn(Cc2cccc3ccccc23)nn1
InChI Key InChIKey=GFVJEWBVMAYCHY-UHFFFAOYSA-N
Data  1 IC50
  Tab Delimited (TSV)   2D SDfile   Computed 3D by Vconf -m prep SDfile
Find this compound or compounds like it in BindingDB:
Activity Spreadsheet -- Enzyme Inhibition Constant Data from BindingDB
Found 1 hit for monomerid = 50420412
TargetRicin(Ricinus communis)
TBA
Curated by ChEMBL
LigandPNGBDBM50420412(CHEMBL2089328)
Affinity DataIC50:  5.00E+5nM. Assay description: Inhibition of Ricinus communis ricin toxin A after 90 mins by luciferase reporter gene assay
In DepthDetails ArticlePubMed