BDBM50420691 CHEMBL2087061
SMILES COc1ccc(cc1)C(=O)Nc1cc(C)ccc1C(C)C
InChI Key InChIKey=KNDUUHNLSWMSMN-UHFFFAOYSA-N
Data  3 IC50  2 EC50
  Tab Delimited (TSV)   2D SDfile   Computed 3D by Vconf -m prep SDfile
Find this compound or compounds like it in BindingDB:
Activity Spreadsheet -- Enzyme Inhibition Constant Data from BindingDB
Found 5 hits for monomerid = 50420691
TargetTransient receptor potential cation channel subfamily M member 8(Rattus norvegicus (Rat))
Sapienza University Of Rome
Curated by ChEMBL
LigandPNGBDBM50420691(CHEMBL2087061)
Affinity DataIC50:  1.47E+4nM. Assay description: Inhibition of rat TRPM8 expressed in HEK293 cells assessed as reduction in 0.25 uM icilin-stimulated increase in intracellular Ca2+ levels
In DepthDetails ArticlePubMed
TargetTransient receptor potential cation channel subfamily M member 8(Rattus norvegicus (Rat))
Sapienza University Of Rome
Curated by ChEMBL
LigandPNGBDBM50420691(CHEMBL2087061)
Affinity DataEC50:  4.80E+3nM. Assay description: Activation of rat TRPM8 expressed in HEK293 cells assessed as stimulation of intracellular Ca2+ levels
In DepthDetails ArticlePubMed
TargetTransient receptor potential cation channel subfamily M member 8(Rattus norvegicus (Rat))
Sapienza University Of Rome
Curated by ChEMBL
LigandPNGBDBM50420691(CHEMBL2087061)
Affinity DataIC50:  1.52E+4nM. Assay description: Inhibition of rat TRPM8 expressed in HEK293 cells assessed as reduction in 20 uM menthol-stimulated increase in intracellular Ca2+ levels
In DepthDetails ArticlePubMed
TargetTransient receptor potential cation channel subfamily A member 1(Rattus norvegicus)
Sapienza University Of Rome
Curated by ChEMBL
LigandPNGBDBM50420691(CHEMBL2087061)
Affinity DataEC50:  4.59E+4nM. Assay description: Activation of rat TRPA1 expressed in HEK293 cells assessed as stimulation of intracellular Ca2+ levels
In DepthDetails ArticlePubMed
TargetTransient receptor potential cation channel subfamily A member 1(Rattus norvegicus)
Sapienza University Of Rome
Curated by ChEMBL
LigandPNGBDBM50420691(CHEMBL2087061)
Affinity DataIC50: >1.00E+5nM. Assay description: Inhibition of rat TRPA1 expressed in HEK293 cells assessed as reduction in 100 uM allyl isothiocyanate-stimulated increase in intracellular Ca2+ leve...
In DepthDetails ArticlePubMed