BDBM50420720 CHEMBL2087480
SMILES Cc1nc(N)ncc1-c1cn2cc(CN3CCN(CC3)S(C)(=O)=O)nc2c(n1)N1CCOCC1
InChI Key InChIKey=WGBOAGRAECSQOH-UHFFFAOYSA-N
Data  1 IC50
  Tab Delimited (TSV)   2D SDfile   Computed 3D by Vconf -m prep SDfile
Find this compound or compounds like it in BindingDB:
Activity Spreadsheet -- Enzyme Inhibition Constant Data from BindingDB
Found 1 hit for monomerid = 50420720
TargetPhosphatidylinositol 3-kinase regulatory subunit alpha/4,5-bisphosphate 3-kinase catalytic subunit alpha isoform(Homo sapiens (Human))
Spanish National Cancer Research Centre (Cnio)
Curated by ChEMBL
LigandPNGBDBM50420720(CHEMBL2087480)
Affinity DataIC50:  32.3nM. Assay description: Inhibition of human PI3Kalpha (p110alpha/p85alpha) by ADP accumulation based HTRF assay
In DepthDetails ArticlePubMed