BDBM50420721 CHEMBL2087481
SMILES CS(=O)(=O)C1CCN(Cc2cn3cc(nc(N4CCOCC4)c3n2)-c2cnc(N)nc2)CC1
InChI Key InChIKey=PQMTULVZXQPOKJ-UHFFFAOYSA-N
Data  1 IC50
  Tab Delimited (TSV)   2D SDfile   Computed 3D by Vconf -m prep SDfile
Find this compound or compounds like it in BindingDB:
Activity Spreadsheet -- Enzyme Inhibition Constant Data from BindingDB
Found 1 hit for monomerid = 50420721
TargetPhosphatidylinositol 3-kinase regulatory subunit alpha/4,5-bisphosphate 3-kinase catalytic subunit alpha isoform(Homo sapiens (Human))
Spanish National Cancer Research Centre (Cnio)
Curated by ChEMBL
LigandPNGBDBM50420721(CHEMBL2087481)
Affinity DataIC50:  28.7nM. Assay description: Inhibition of human PI3Kalpha (p110alpha/p85alpha) by ADP accumulation based HTRF assay
In DepthDetails ArticlePubMed