BDBM50420745 CHEMBL2087523
SMILES CC(=O)NC(C)(C)c1nnc2cc(ccn12)-c1cc(cc(F)c1C)C(=O)NC1CC1
InChI Key InChIKey=NSDUXNLLUZMQCM-UHFFFAOYSA-N
Data  1 IC50
  Tab Delimited (TSV)   2D SDfile   Computed 3D by Vconf -m prep SDfile
Find this compound or compounds like it in BindingDB:
Activity Spreadsheet -- Enzyme Inhibition Constant Data from BindingDB
Found 1 hit for monomerid = 50420745
TargetMitogen-activated protein kinase 13(Homo sapiens (Human))
RhôNe-Poulenc Rorer
Curated by ChEMBL
LigandPNGBDBM50420745(CHEMBL2087523)
Affinity DataIC50:  253nM. Assay description: Inhibition of p38alpha
In DepthDetails ArticlePubMed