BDBM50421110 CHEMBL2088368
SMILES CN(C)Cc1ccccc1N(C)C(=O)Cn1c2cc(ccc2oc1=O)-c1ccccc1
InChI Key InChIKey=KTGFLRHSKZPLTM-UHFFFAOYSA-N
Data  1 KI
  Tab Delimited (TSV)   2D SDfile   Computed 3D by Vconf -m prep SDfile
Find this compound or compounds like it in BindingDB:
Activity Spreadsheet -- Enzyme Inhibition Constant Data from BindingDB
Found 1 hit for monomerid = 50421110
TargetTranslocator protein(Rattus norvegicus (rat))
Dainippon Sumitomo Pharma
Curated by ChEMBL
LigandPNGBDBM50421110(CHEMBL2088368)
Affinity DataKi:  2nM. Assay description: Displacement of [3H]PK11195 from TSPO receptor in rat Sprague-Dawley kidney membranes after 1 hr by liquid scintillation counting
In DepthDetails ArticlePubMed