BDBM50421482 CHEMBL169477
SMILES NC(=N)c1ccc(cc1)C(=O)NCCC(=O)N1CCC(COC(O)=O)CC1
InChI Key InChIKey=XBPSCIYZICSYSB-UHFFFAOYSA-N
Data  1 IC50
  Tab Delimited (TSV)   2D SDfile   Computed 3D by Vconf -m prep SDfile
Find this compound or compounds like it in BindingDB:
Activity Spreadsheet -- Enzyme Inhibition Constant Data from BindingDB
Found 1 hit for monomerid = 50421482
TargetIntegrin alpha-IIb/beta-3(Homo sapiens (Human))
Kyoto University
Curated by ChEMBL
LigandPNGBDBM50421482(CHEMBL169477)
Affinity DataIC50:  1.82E+4nM. Assay description: The compound was tested for its inhibitory activity against platelet aggregation
In DepthDetails ArticlePubMed