BDBM50421889 CHEMBL2311199
SMILES Nc1nc(OCCCc2ccccc2)nc2n(cnc12)[C@H]1O[C@@H](CO)[C@H](O)[C@@H]1O
InChI Key InChIKey=UDWLAWJOABGYPL-OWCBBSPXSA-N
Data  2 EC50
  Tab Delimited (TSV)   2D SDfile   Computed 3D by Vconf -m prep SDfile
Find this compound or compounds like it in BindingDB:
Activity Spreadsheet -- Enzyme Inhibition Constant Data from BindingDB
Found 2 hits for monomerid = 50421889
TargetAdenosine receptor A2a/A2b(Homo sapiens (Human))
University Of South Florida
Curated by ChEMBL
LigandPNGBDBM50421889(CHEMBL2311199)
Affinity DataEC50:  62nM. Assay description: Concentration required for coronary arteries vasodilation at the A2 adenosine receptor in langendorff guinea pig heart preparation
In DepthDetails ArticlePubMed
TargetAdenosine receptor A1(GUINEA PIG)
University Of South Florida
Curated by ChEMBL
LigandPNGBDBM50421889(CHEMBL2311199)
Affinity DataEC50:  2.00E+4nM. Assay description: Effective concentration required for prolongation of the stimulus-QRS interval by 50% of the maximum response at the A1 adenosine receptor in langend...
In DepthDetails ArticlePubMed