BDBM50421917 CHEMBL2093874
SMILES CCCCN1CC[C@H]2[C@@H](CCc3ccccc23)C1
InChI Key InChIKey=HHEIQDXGHHAKRI-RDJZCZTQSA-N
Data  2 IC50
  Tab Delimited (TSV)   2D SDfile   Computed 3D by Vconf -m prep SDfile
Find this compound or compounds like it in BindingDB:
Activity Spreadsheet -- Enzyme Inhibition Constant Data from BindingDB
Found 2 hits for monomerid = 50421917
TargetD(2) dopamine receptor(Rattus norvegicus (rat))
Merck Sharp And Dohme Research Laboratories
Curated by ChEMBL
LigandPNGBDBM50421917(CHEMBL2093874)
Affinity DataIC50:  389nM. Assay description: Inhibition of [3H](-)-sulpiride binding to rat striatum dopamine receptor D2
In DepthDetails ArticlePubMed
TargetSigma non-opioid intracellular receptor 1(Homo sapiens (Human))
Merck Sharp And Dohme Research Laboratories
Curated by ChEMBL
LigandPNGBDBM50421917(CHEMBL2093874)
Affinity DataIC50:  3.10nM. Assay description: In vitro for the binding affinity against sigma receptor by using [3H]DTG as radioligand in guinea pig cerebellum
In DepthDetails ArticlePubMed