BDBM50421989 CHEMBL611903
SMILES CCCc1ccccc1Nc1ncnc2n(cnc12)C1O[C@H](CO)[C@@H](O)[C@H]1O
InChI Key InChIKey=JMNYEQNBORDPSL-XAUNWSGPSA-N
Data  2 IC50
  Tab Delimited (TSV)   2D SDfile   Computed 3D by Vconf -m prep SDfile
Find this compound or compounds like it in BindingDB:
Activity Spreadsheet -- Enzyme Inhibition Constant Data from BindingDB
Found 2 hits for monomerid = 50421989
TargetAdenosine receptor A1(Rattus norvegicus (rat))
Center For Bio-Pharmaceutical Sciences
Curated by ChEMBL
LigandPNGBDBM50421989(CHEMBL611903)
Affinity DataIC50:  1.20nM. Assay description: Evaluated for binding affinity against Adenosine A1 receptorChecked by Author
In DepthDetails ArticlePubMed
TargetAdenosine receptor A1(Rattus norvegicus (rat))
Center For Bio-Pharmaceutical Sciences
Curated by ChEMBL
LigandPNGBDBM50421989(CHEMBL611903)
Affinity DataIC50:  1.20nM. Assay description: Evaluated for binding affinity against Adenosine A1 receptorChecked by Author
In DepthDetails ArticlePubMed