BDBM50421992 CHEMBL604860
SMILES COc1ccccc1Nc1ncnc2n(cnc12)C1O[C@H](CO)[C@@H](O)[C@H]1O
InChI Key InChIKey=MZZZNHQEMKZNJS-IKYDMHQPSA-N
Data  1 IC50
  Tab Delimited (TSV)   2D SDfile   Computed 3D by Vconf -m prep SDfile
Find this compound or compounds like it in BindingDB:
Activity Spreadsheet -- Enzyme Inhibition Constant Data from BindingDB
Found 1 hit for monomerid = 50421992
TargetAdenosine receptor A1(Rattus norvegicus (rat))
Center For Bio-Pharmaceutical Sciences
Curated by ChEMBL
LigandPNGBDBM50421992(CHEMBL604860)
Affinity DataIC50:  85nM. Assay description: Evaluated for binding affinity against Adenosine A1 receptorChecked by Author
In DepthDetails ArticlePubMed