BDBM50421996 CHEMBL608355
SMILES COc1cccc(Nc2ncnc3n(cnc23)C2O[C@H](CO)[C@@H](O)[C@H]2O)c1
InChI Key InChIKey=ZTHFTTGBECQSLF-IKYDMHQPSA-N
Data  1 IC50
  Tab Delimited (TSV)   2D SDfile   Computed 3D by Vconf -m prep SDfile
Find this compound or compounds like it in BindingDB:
Activity Spreadsheet -- Enzyme Inhibition Constant Data from BindingDB
Found 1 hit for monomerid = 50421996
TargetAdenosine receptor A1(Rattus norvegicus (rat))
Center For Bio-Pharmaceutical Sciences
Curated by ChEMBL
LigandPNGBDBM50421996(CHEMBL608355)
Affinity DataIC50:  47nM. Assay description: Evaluated for binding affinity against Adenosine A1 receptorChecked by Author
In DepthDetails ArticlePubMed