BDBM50422517 CHEMBL149348
SMILES CC[C@H](N1C[C@H](CO[N+]([O-])=O)CC1=O)C(N)=O
InChI Key InChIKey=NNDLJCGSVUKDRH-RQJHMYQMSA-N
Data  1 IC50
  Tab Delimited (TSV)   2D SDfile   Computed 3D by Vconf -m prep SDfile
Find this compound or compounds like it in BindingDB:
Activity Spreadsheet -- Enzyme Inhibition Constant Data from BindingDB
Found 1 hit for monomerid = 50422517
TargetSynaptic vesicle glycoprotein 2A(Rattus norvegicus)
Ucb Pharma
Curated by ChEMBL
LigandPNGBDBM50422517(CHEMBL149348)
Affinity DataIC50:  100nM. Assay description: In vitro inhibitory activity against [3H](2S)-2-[4-(3-azidophenyl)-2-oxopyrrolidin-1-yl]butanamide binding to levetiracetam binding siteChecked by Author
In DepthDetails ArticlePubMed