BDBM50422927 CHEMBL441368
SMILES COc1cc(ccc1OCCN1CCCC1)-n1cnc2cc(sc2c1=O)-c1ccc(Cl)c(Cl)c1
InChI Key InChIKey=CZDLKMLCDRFFRS-UHFFFAOYSA-N
Data  1 IC50
  Tab Delimited (TSV)   2D SDfile   Computed 3D by Vconf -m prep SDfile
Find this compound or compounds like it in BindingDB:
Activity Spreadsheet -- Enzyme Inhibition Constant Data from BindingDB
Found 1 hit for monomerid = 50422927
TargetMelanin-concentrating hormone receptor 1(Homo sapiens (Human))
Glaxosmithkline
Curated by ChEMBL
LigandPNGBDBM50422927(CHEMBL441368)
Affinity DataIC50:  1.60nM. Assay description: Antagonist activity against human MCHR1 expressed in CHO cells by luciferase reporter gene assay
In DepthDetails ArticlePubMed