BDBM50423056 CHEMBL243002
SMILES CC(=O)NCC1(CCCCC1)c1cn2CCCc3cccc1c23
InChI Key InChIKey=YIGCYAJXYJBOOS-UHFFFAOYSA-N
Data  1 IC50
  Tab Delimited (TSV)   2D SDfile   Computed 3D by Vconf -m prep SDfile
Find this compound or compounds like it in BindingDB:
Activity Spreadsheet -- Enzyme Inhibition Constant Data from BindingDB
Found 1 hit for monomerid = 50423056
TargetMelatonin receptor type 1C(Xenopus)
University Of Athens
Curated by ChEMBL
LigandPNGBDBM50423056(CHEMBL243002)
Affinity DataIC50:  1.18E+3nM. Assay description: Antagonist activity in Xenopus laevis melanophores assessed as melatoninergic activity after 60 mins
In DepthDetails ArticlePubMed