BDBM50423108 CHEMBL612024
SMILES CN(CCCCCCOc1ccc2C(=CS(=O)(=O)c2c1)c1ccc(Br)cc1)CC=C
InChI Key InChIKey=UCLKFGYCQCKOSE-UHFFFAOYSA-N
Data  1 IC50
  Tab Delimited (TSV)   2D SDfile   Computed 3D by Vconf -m prep SDfile
Find this compound or compounds like it in BindingDB:
Activity Spreadsheet -- Enzyme Inhibition Constant Data from BindingDB
Found 1 hit for monomerid = 50423108
TargetLanosterol synthase(Homo sapiens (Human))
Universit£
Curated by ChEMBL
LigandPNGBDBM50423108(CHEMBL612024)
Affinity DataIC50:  7.80nM. Assay description: Inhibition of oxidosqualene cyclase
In DepthDetails ArticlePubMed