BDBM50423474 CHEMBL398712
SMILES CN1C[C@@H](C[C@H]2[C@H]1Cc1c(Cl)[nH]c3cccc2c13)C(=O)N1CCN(CC1)c1ccc(cc1)[N+]([O-])=O
InChI Key InChIKey=NLNAFNZFBHZFQC-AYPBNUJASA-N
Data  2 Kd
  Tab Delimited (TSV)   2D SDfile   Computed 3D by Vconf -m prep SDfile
Find this compound or compounds like it in BindingDB:
Activity Spreadsheet -- Enzyme Inhibition Constant Data from BindingDB
Found 2 hits for monomerid = 50423474
TargetSomatostatin receptor type 2(RAT)
Novartis Institutes For Biomedical Research
Curated by ChEMBL
LigandPNGBDBM50423474(CHEMBL398712)
Affinity DataKd:  8.91E+3nM. Assay description: Displacement of [125I][Tyr3]octreotide from sst2 receptor in rat cortex
In DepthDetails ArticlePubMed
TargetSomatostatin receptor type 1(RAT)
Novartis Institutes For Biomedical Research
Curated by ChEMBL
LigandPNGBDBM50423474(CHEMBL398712)
Affinity DataKd:  1.30nM. Assay description: Displacement of [125I]SRIF14 from sst1 receptor in rat cortex
In DepthDetails ArticlePubMed