BDBM50423638 CHEMBL410266
SMILES Oc1c(C(c2ccccc2Br)c2c(O)c3ccccc3oc2=O)c(=O)oc2ccccc12
InChI Key InChIKey=QGRZIEGWRRMGBI-UHFFFAOYSA-N
Data  1 IC50
  Tab Delimited (TSV)   2D SDfile   Computed 3D by Vconf -m prep SDfile
Find this compound or compounds like it in BindingDB:
Activity Spreadsheet -- Enzyme Inhibition Constant Data from BindingDB
Found 1 hit for monomerid = 50423638
TargetUrease(Canavalia ensiformis (Jack bean) (Horse bean))
University Of Karachi
Curated by ChEMBL
LigandPNGBDBM50423638(CHEMBL410266)
Affinity DataIC50:  7.41E+4nM. Assay description: Inhibition of jack bean urease
In DepthDetails ArticlePubMed