BDBM50423676 CHEMBL571944
SMILES Cc1ccccc1Nc1nc2ccc(CC(=O)N3C[C@@H](F)C[C@H]3CO[C@H]3CC[C@@H](CC3)C(O)=O)c(F)c2o1
InChI Key InChIKey=PZAWHTBRRKZOPW-VMXMFDLUSA-N
Data  2 IC50
  Tab Delimited (TSV)   2D SDfile   Computed 3D by Vconf -m prep SDfile
Find this compound or compounds like it in BindingDB:
Activity Spreadsheet -- Enzyme Inhibition Constant Data from BindingDB
Found 2 hits for monomerid = 50423676
TargetIntegrin alpha-4/beta-1(Homo sapiens (Human))
Daiichi Sankyo
Curated by ChEMBL
LigandPNGBDBM50423676(CHEMBL571944)
Affinity DataIC50:  70nM. Assay description: Inhibition of europium labeled human VCAM1/Fc chimera binding to human VLA-4 alpha-4-beta-1 expressed in Chinese hamster 4B4 cells in presence of 3% ...
In DepthDetails ArticlePubMed
TargetIntegrin alpha-4/beta-1(Homo sapiens (Human))
Daiichi Sankyo
Curated by ChEMBL
LigandPNGBDBM50423676(CHEMBL571944)
Affinity DataIC50:  3nM. Assay description: Inhibition of europium labeled human VCAM1/Fc chimera binding to human VLA-4 alpha-4-beta-1 expressed in Chinese hamster 4B4 cells by fluorimetric as...
In DepthDetails ArticlePubMed