BDBM50424135 CHEMBL2316371
SMILES COc1cccc2occ(\C=C\C(O)c3ccc(O)cc3)c(=O)c12
InChI Key InChIKey=VVRVSSSNKLMIDS-JXMROGBWSA-N
Data  1 IC50
  Tab Delimited (TSV)   2D SDfile   Computed 3D by Vconf -m prep SDfile
Find this compound or compounds like it in BindingDB:
Activity Spreadsheet -- Enzyme Inhibition Constant Data from BindingDB
Found 1 hit for monomerid = 50424135
TargetInterleukin-5(Mus musculus)
Chungnam National University
Curated by ChEMBL
LigandPNGBDBM50424135(CHEMBL2316371)
Affinity DataIC50: >3.00E+4nM. Assay description: Inhibition of IL-5 in mouse pro-B Y16 cells after 48 hrs by WST1 assay
In DepthDetails ArticlePubMed