BDBM50424261 CHEMBL2314463
SMILES CC[C@H](CO)Nc1nc(Nc2ncccn2)c2ncn(C(C)C)c2n1
InChI Key InChIKey=CLTIRFBQVYXMKS-LLVKDONJSA-N
Data  2 IC50
  Tab Delimited (TSV)   2D SDfile   Computed 3D by Vconf -m prep SDfile
Find this compound or compounds like it in BindingDB:
Activity Spreadsheet -- Enzyme Inhibition Constant Data from BindingDB
Found 2 hits for monomerid = 50424261
TargetCyclin-dependent kinase 5 activator 1(Homo sapiens (Human))
University Of Paris
Curated by ChEMBL
LigandPNGBDBM50424261(CHEMBL2314463)
Affinity DataIC50: >1.00E+4nM. Assay description: Inhibition of recombinant human CDK5/p25 after 30 mins by scintillation counting
In DepthDetails ArticlePubMed
TargetDual specificity tyrosine-phosphorylation-regulated kinase 1A(Homo sapiens (Human))
University Of Paris
Curated by ChEMBL
LigandPNGBDBM50424261(CHEMBL2314463)
Affinity DataIC50: >1.00E+4nM. Assay description: Inhibition of recombinant GST-fused human DYRK1A expressed in Escherichia coli using KKISGRLSPIMTEQ as substrate
In DepthDetails ArticlePubMed