BDBM50424388 CHEMBL2315051
SMILES CC(C)(C)NC(=O)c1cccc(Cc2cc(Cl)ccc2OCc2ccc(Cl)cc2F)n1
InChI Key InChIKey=SXONLDCVNFEQCH-UHFFFAOYSA-N
Data  1 Kd
  Tab Delimited (TSV)   2D SDfile   Computed 3D by Vconf -m prep SDfile
Find this compound or compounds like it in BindingDB:
Activity Spreadsheet -- Enzyme Inhibition Constant Data from BindingDB
Found 1 hit for monomerid = 50424388
TargetProstaglandin E2 receptor EP1 subtype(Mus musculus (Mouse))
Vanderbilt University School Of Medicine
Curated by ChEMBL
LigandPNGBDBM50424388(CHEMBL2315051)
Affinity DataKd:  4.36E+3nM. Assay description: Antagonist activity at mouse EP1 receptor expressed in CHOK1 cells assessed as inhibition of 17PTPGE2-induced calcium influx
In DepthDetails ArticlePubMed