BDBM50424419 CHEMBL2315739
SMILES Clc1ccc(\C=C2/S\C(NC2=O)=N\c2nccs2)c(Cl)c1
InChI Key InChIKey=AFRRMWDAFFDQTI-YHYXMXQVSA-N
Data  1 IC50
  Tab Delimited (TSV)   2D SDfile   Computed 3D by Vconf -m prep SDfile
Find this compound or compounds like it in BindingDB:
Activity Spreadsheet -- Enzyme Inhibition Constant Data from BindingDB
Found 1 hit for monomerid = 50424419
TargetProstaglandin G/H synthase 1(Ovis aries (Sheep))
Department Of Pharmaceutical Chemistry Of Aristotle University Of Thessaloniki
Curated by ChEMBL
LigandPNGBDBM50424419(CHEMBL2315739)
Affinity DataIC50:  3.20E+4nM. Assay description: Inhibition of ovine COX1 assessed as inhibition of PGF2a production by enzyme immunoassay
In DepthDetails ArticlePubMed