BDBM50424420 CHEMBL2315738
SMILES Clc1cccc(Cl)c1\C=C1/S\C(NC1=O)=N\c1nccs1
InChI Key InChIKey=VYQUIOSPDRPTFU-POHAHGRESA-N
Data  1 IC50
  Tab Delimited (TSV)   2D SDfile   Computed 3D by Vconf -m prep SDfile
Find this compound or compounds like it in BindingDB:
Activity Spreadsheet -- Enzyme Inhibition Constant Data from BindingDB
Found 1 hit for monomerid = 50424420
TargetProstaglandin G/H synthase 1(Ovis aries (Sheep))
Department Of Pharmaceutical Chemistry Of Aristotle University Of Thessaloniki
Curated by ChEMBL
LigandPNGBDBM50424420(CHEMBL2315738)
Affinity DataIC50:  7.80E+4nM. Assay description: Inhibition of ovine COX1 assessed as inhibition of PGF2a production by enzyme immunoassay
In DepthDetails ArticlePubMed