BDBM50424503 CHEMBL2316739
SMILES COc1ccc(cc1)C1=C(Cl)C(=O)N(C1=O)c1ccc(Cl)c(Cl)c1
InChI Key InChIKey=FNKBEGHNLRZRKZ-UHFFFAOYSA-N
Data  1 IC50
  Tab Delimited (TSV)   2D SDfile   Computed 3D by Vconf -m prep SDfile
Find this compound or compounds like it in BindingDB:
Activity Spreadsheet -- Enzyme Inhibition Constant Data from BindingDB
Found 1 hit for monomerid = 50424503
TargetDNA repair protein RAD51 homolog 1(Homo sapiens (Human))
University Of Chicago
Curated by ChEMBL
LigandPNGBDBM50424503(CHEMBL2316739)
Affinity DataIC50:  5.29E+3nM. Assay description: Inhibition of human RAD51 binding to single stranded DNA by fluorescence polarization assay
In DepthDetails ArticlePubMed