BDBM50424723 CHEMBL2314523
SMILES Cc1ccc2c(Cl)c(sc2c1)C(O)=O
InChI Key InChIKey=KWGVHWHFCFSQAZ-UHFFFAOYSA-N
Data  3 KI
  Tab Delimited (TSV)   2D SDfile   Computed 3D by Vconf -m prep SDfile
Find this compound or compounds like it in BindingDB:
Activity Spreadsheet -- Enzyme Inhibition Constant Data from BindingDB
Found 3 hits for monomerid = 50424723
TargetInduced myeloid leukemia cell differentiation protein Mcl-1(Homo sapiens (Human))
Vanderbilt University School Of Medicine
Curated by ChEMBL
LigandPNGBDBM50424723(CHEMBL2314523)
Affinity DataKi:  4.00E+4nM. Assay description: Displacement of FITC-AHx-KALETLRRVGDGVQRNHETAF-NH2 from human MCl1 (172 to 327) expressed in Escherichia coli BL21 (DE3) after 1 hr by fluorescence p...
In DepthDetails ArticlePubMed
TargetBcl-2-like protein 1(Homo sapiens (Human))
Vanderbilt University School Of Medicine
Curated by ChEMBL
LigandPNGBDBM50424723(CHEMBL2314523)
Affinity DataKi:  2.30E+5nM. Assay description: Displacement of FITC-AHx-GQVGRQLAIIGDDINR-NH2 from Bcl-xL (unknown origin) after 1 hr by fluorescence polarization anisotropy assay
In DepthDetails ArticlePubMed
TargetApoptosis regulator Bcl-2(Homo sapiens (Human))
Vanderbilt University School Of Medicine
Curated by ChEMBL
LigandPNGBDBM50424723(CHEMBL2314523)
Affinity DataKi: >1.00E+6nM. Assay description: Displacement of FITC-AHx-GQVGRQLAIIGDDINR-NH2 from Bcl2 (unknown origin) after 1 hr by fluorescence polarization anisotropy assay
In DepthDetails ArticlePubMed