BDBM50424850 CHEMBL2315467::US9737525, Compound MIND4-19
SMILES C(Oc1ccccc1)c1nnc(SCc2ccccc2)n1-c1ccccc1
InChI Key InChIKey=SSZGXGUFAAHHAF-UHFFFAOYSA-N
Data  2 IC50
  Tab Delimited (TSV)   2D SDfile   Computed 3D by Vconf -m prep SDfile
Find this compound or compounds like it in BindingDB:
Activity Spreadsheet -- Enzyme Inhibition Constant Data from BindingDB
Found 2 hits for monomerid = 50424850
TargetNAD-dependent protein deacetylase sirtuin-2(Homo sapiens (Human))
The General Hospital
US Patent
LigandPNGBDBM50424850(CHEMBL2315467 | US9737525, Compound MIND4-19)
Affinity DataIC50:  7.00E+3nM. Assay description: Modulation of sirtuin activity by compounds was assessed using the Flour de Lys fluorescent biochemical assay in a 96-well format as described (Outei...
In DepthDetails US Patent
TargetTransitional endoplasmic reticulum ATPase(Homo sapiens (Human))
TBA
Curated by ChEMBL
LigandPNGBDBM50424850(CHEMBL2315467 | US9737525, Compound MIND4-19)
Affinity DataIC50: >3.00E+4nM. Assay description: Inhibition of human recombinant His-GST tagged VCP expressed in baculovirus infected Hi5 cells assessed as ADP formation incubated for 20 mins proir ...
In DepthDetails ArticlePubMed