BDBM50424880 CHEMBL2315454
SMILES Cc1cc(OCc2nnc(SC3CCCC3)n2-c2cccnc2)cc(C)c1Cl
InChI Key InChIKey=OJYCLLABLJLPEC-UHFFFAOYSA-N
Data  1 IC50
  Tab Delimited (TSV)   2D SDfile   Computed 3D by Vconf -m prep SDfile
Find this compound or compounds like it in BindingDB:
Activity Spreadsheet -- Enzyme Inhibition Constant Data from BindingDB
Found 1 hit for monomerid = 50424880
TargetTransitional endoplasmic reticulum ATPase(Homo sapiens (Human))
TBA
Curated by ChEMBL
LigandPNGBDBM50424880(CHEMBL2315454)
Affinity DataIC50:  134nM. Assay description: Inhibition of human recombinant His-GST tagged VCP expressed in baculovirus infected Hi5 cells assessed as ADP formation incubated for 20 mins proir ...
In DepthDetails ArticlePubMed