BDBM50425064 CHEMBL2312898
SMILES COc1ccc2C(=O)c3c(-c2c1)n(CCCN=[N+]=[N-])c(=O)c1cc(ccc31)[N+]([O-])=O
InChI Key InChIKey=BDVSBDHYOYIIKX-UHFFFAOYSA-N
Data  1 IC50
  Tab Delimited (TSV)   2D SDfile   Computed 3D by Vconf -m prep SDfile
Find this compound or compounds like it in BindingDB:
Activity Spreadsheet -- Enzyme Inhibition Constant Data from BindingDB
Found 1 hit for monomerid = 50425064
TargetTyrosyl-DNA phosphodiesterase 1(Homo sapiens (Human))
Purdue University
Curated by ChEMBL
LigandPNGBDBM50425064(CHEMBL2312898)
Affinity DataIC50: >1.11E+5nM. Assay description: Inhibition of recombinant Tdp1 (unknown origin) using 5'-[32P]-labeled single-stranded DNA oligonucleotide containing 3'-phosphotyrosine as substrate...
In DepthDetails ArticlePubMed