BDBM50425069 CHEMBL2312891
SMILES NCCCn1c2-c3ccccc3C(=O)c2c2ccc(NC(=O)CCCCC(O)=O)cc2c1=O
InChI Key InChIKey=ZTZGSAQMOAXLHI-UHFFFAOYSA-N
Data  1 IC50
  Tab Delimited (TSV)   2D SDfile   Computed 3D by Vconf -m prep SDfile
Find this compound or compounds like it in BindingDB:
Activity Spreadsheet -- Enzyme Inhibition Constant Data from BindingDB
Found 1 hit for monomerid = 50425069
TargetTyrosyl-DNA phosphodiesterase 1(Homo sapiens (Human))
Purdue University
Curated by ChEMBL
LigandPNGBDBM50425069(CHEMBL2312891)
Affinity DataIC50: >1.11E+5nM. Assay description: Inhibition of recombinant Tdp1 (unknown origin) using 5'-[32P]-labeled single-stranded DNA oligonucleotide containing 3'-phosphotyrosine as substrate...
In DepthDetails ArticlePubMed