BDBM50425075 CHEMBL2312569
SMILES COC(=O)CCCC(=O)Nc1ccc2c3C(=O)c4ccccc4-c3n(CCCNC(=O)OC(C)(C)C)c(=O)c2c1
InChI Key InChIKey=BRHPJQDYYFHAKS-UHFFFAOYSA-N
Data  1 IC50
  Tab Delimited (TSV)   2D SDfile   Computed 3D by Vconf -m prep SDfile
Find this compound or compounds like it in BindingDB:
Activity Spreadsheet -- Enzyme Inhibition Constant Data from BindingDB
Found 1 hit for monomerid = 50425075
TargetTyrosyl-DNA phosphodiesterase 1(Homo sapiens (Human))
Purdue University
Curated by ChEMBL
LigandPNGBDBM50425075(CHEMBL2312569)
Affinity DataIC50: >1.11E+5nM. Assay description: Inhibition of recombinant Tdp1 (unknown origin) using 5'-[32P]-labeled single-stranded DNA oligonucleotide containing 3'-phosphotyrosine as substrate...
In DepthDetails ArticlePubMed