BDBM50425360 CHEMBL2316207
SMILES Fc1ccc(Nc2ccc3c(CCc4ccc(cc4C3=O)C(=O)NCCN3CCOCC3)c2)cc1NC(=O)c1ccccc1
InChI Key InChIKey=JWZSSEWMVYKYKW-UHFFFAOYSA-N
Data  7 IC50  2 Kd
PDB links: 1 PDB ID matches this monomer.
  Tab Delimited (TSV)   2D SDfile   Computed 3D by Vconf -m prep SDfile
Find this compound or compounds like it in BindingDB:
Activity Spreadsheet -- Enzyme Inhibition Constant Data from BindingDB
Found 9 hits for monomerid = 50425360
TargetMitogen-activated protein kinase 14(Homo sapiens (Human))
University Of T£Bingen
Curated by ChEMBL
LigandPNGBDBM50425360(CHEMBL2316207)
Affinity DataIC50:  0.200nM. Assay description: Inhibition of p38alpha MAP kinase (unknown origin) by ELISA
TargetMitogen-activated protein kinase 14(Homo sapiens (Human))
University Of T£Bingen
Curated by ChEMBL
LigandPNGBDBM50425360(CHEMBL2316207)
Affinity DataIC50:  31nM. Assay description: Inhibition of p38alpha MAP kinase in whole blood (unknown origin) assessed as lipopolysaccharide-stimulated TNF-alpha release by ELISA
TargetMitogen-activated protein kinase 14(Homo sapiens (Human))
University Of T£Bingen
Curated by ChEMBL
LigandPNGBDBM50425360(CHEMBL2316207)
Affinity DataKd:  3.10nM. Assay description: Binding affinity to wild type human biotin labelled p38 alpha (9 to 352 residues) expressed in sf21 insect cells SPR analysis
TargetMitogen-activated protein kinase 14(Homo sapiens (Human))
University Of T£Bingen
Curated by ChEMBL
LigandPNGBDBM50425360(CHEMBL2316207)
Affinity DataKd:  3.90nM. Assay description: Binding affinity to wild type human biotin labelled p38 alpha (9 to 352 residues) expressed in sf21 insect cells assessed as dissociation rate consta...
TargetMitogen-activated protein kinase 14(Homo sapiens (Human))
University Of T£Bingen
Curated by ChEMBL
LigandPNGBDBM50425360(CHEMBL2316207)
Affinity DataIC50:  38nM. Assay description: Inhibition of p38alpha MAPK in human whole blood assessed as reduction in LPS-induced TNFalpha production preincubated for 2.5 hrs followed by LPS st...
TargetMitogen-activated protein kinase 14(Homo sapiens (Human))
University Of T£Bingen
Curated by ChEMBL
LigandPNGBDBM50425360(CHEMBL2316207)
Affinity DataIC50:  38nM. Assay description: Inhibition of P38 alpha MAPK in human whole blood assessed as reduction in TNF-alpha release after 10 mins by ELISA
TargetMitogen-activated protein kinase 14(Homo sapiens (Human))
University Of T£Bingen
Curated by ChEMBL
LigandPNGBDBM50425360(CHEMBL2316207)
Affinity DataIC50:  4nM. Assay description: Inhibition of recombinant human full-length N-terminal GST-tagged p38alpha MAPK expressed in baculovirus infected Sf9 insect cells using p38 peptide ...
TargetMitogen-activated protein kinase 14(Homo sapiens (Human))
University Of T£Bingen
Curated by ChEMBL
LigandPNGBDBM50425360(CHEMBL2316207)
Affinity DataIC50:  4.30nM. Assay description: Inhibition of NanoBRET kinase tracer K4 binding to full-length human C-terminal NanoLuc-tagged p38alpha MAPK expressed in HEK293T cells incubated for...
TargetMitogen-activated protein kinase 14(Homo sapiens (Human))
University Of T£Bingen
Curated by ChEMBL
LigandPNGBDBM50425360(CHEMBL2316207)
Affinity DataIC50:  0.200nM. Assay description: Inhibition of P38 alpha MAPK (unknown origin) by ELISA