BDBM50426095 CHEMBL2316272
SMILES CCCCCn1cc(C(=O)NC2CCCCC2)c(=O)c2cnn(C)c12
InChI Key InChIKey=JLRWXZDRAZQWDA-UHFFFAOYSA-N
Data  4 KI  1 EC50
  Tab Delimited (TSV)   2D SDfile   Computed 3D by Vconf -m prep SDfile
Find this compound or compounds like it in BindingDB:
Activity Spreadsheet -- Enzyme Inhibition Constant Data from BindingDB
Found 5 hits for monomerid = 50426095
TargetCannabinoid receptor 2(Homo sapiens (Human))
Universit£
Curated by ChEMBL
LigandPNGBDBM50426095(CHEMBL2316272)
Affinity DataKi:  237nM. Assay description: Displacement of [3H]CP-55,940 from human recombinant CB2 receptor expressed in CHO cell membranes after 60 mins by scintillation counting analysis
In DepthDetails ArticlePubMed
TargetCannabinoid receptor 2(Rattus norvegicus (Rat))
Universit£
Curated by ChEMBL
LigandPNGBDBM50426095(CHEMBL2316272)
Affinity DataKi:  250nM. Assay description: Displacement of [3H]CP-55,940 from Sprague-Dawley rat spleen CB2 receptor by scintillation counting analysis
In DepthDetails ArticlePubMed
TargetCannabinoid receptor 1(Homo sapiens (Human))
Universit£
Curated by ChEMBL
LigandPNGBDBM50426095(CHEMBL2316272)
Affinity DataKi:  5.15E+3nM. Assay description: Displacement of [3H]CP-55,940 from human recombinant CB1 receptor expressed in CHO cell membranes after 90 mins by scintillation counting analysis
In DepthDetails ArticlePubMed
TargetCannabinoid receptor 1(Rattus norvegicus (rat))
Universit£
Curated by ChEMBL
LigandPNGBDBM50426095(CHEMBL2316272)
Affinity DataKi:  5.65E+3nM. Assay description: Displacement of [3H]CP-55,940 from Sprague-Dawley rat brain CB1 receptor by scintillation counting analysis
In DepthDetails ArticlePubMed
TargetCannabinoid receptor 2(Homo sapiens (Human))
Universit£
Curated by ChEMBL
LigandPNGBDBM50426095(CHEMBL2316272)
Affinity DataEC50:  872nM. Assay description: Agonist activity at human CB2 receptor expressed in CHO cells assessed as forskolin-stimulated [3H]cyclic-AMP accumulation by scintillation counting ...
In DepthDetails ArticlePubMed