BDBM50426309 CHEMBL2321969
SMILES COC(=O)c1ccc2N\C(C(=O)c2c1)=C1/C(=O)Nc2c1cccc2Br
InChI Key InChIKey=NYTOIQMFKVKANY-SQFISAMPSA-N
Data  5 IC50
  Tab Delimited (TSV)   2D SDfile   Computed 3D by Vconf -m prep SDfile
Find this compound or compounds like it in BindingDB:
Activity Spreadsheet -- Enzyme Inhibition Constant Data from BindingDB
Found 5 hits for monomerid = 50426309
TargetDual specificity tyrosine-phosphorylation-regulated kinase 2(Homo sapiens (Human))
University Of Athens
Curated by ChEMBL
LigandPNGBDBM50426309(CHEMBL2321969)
Affinity DataIC50: >1.00E+4nM. Assay description: Inhibition of human recombinant GST-fused DYRK2 expressed in Escherichia coli using KKISGRLSPIMTEQ as substrate after 30 mins by scintillation counti...
In DepthDetails ArticlePubMed
LigandPNGBDBM50426309(CHEMBL2321969)
Affinity DataIC50: >1.00E+4nM. Assay description: Inhibition of rat recombinant GST-fused DYRK1A expressed in Escherichia coli using KKISGRLSPIMTEQ as substrate after 30 mins by scintillation countin...
In DepthDetails ArticlePubMed
TargetCyclin-dependent kinase 5(Homo sapiens (Human))
University Of Athens
Curated by ChEMBL
LigandPNGBDBM50426309(CHEMBL2321969)
Affinity DataIC50: >1.00E+4nM. Assay description: Inhibition of human recombinant CDK5
In DepthDetails ArticlePubMed
TargetGlycogen synthase kinase-3 beta(Sus scrofa)
University Of Athens
Curated by ChEMBL
LigandPNGBDBM50426309(CHEMBL2321969)
Affinity DataIC50:  2.50E+4nM. Assay description: Inhibition of porcine brain GSK3beta using YRRAAVPPSPSLSRHSSPHQSpEDEEE as substrate
In DepthDetails ArticlePubMed
TargetCasein kinase I isoform alpha(Sus scrofa)
University Of Athens
Curated by ChEMBL
LigandPNGBDBM50426309(CHEMBL2321969)
Affinity DataIC50: >1.00E+4nM. Assay description: Inhibition of porcine brain CK1 using RRKHAAIGpSAYSITA as substrate
In DepthDetails ArticlePubMed