BDBM50426620 CHEMBL2326176
SMILES CN1CCC(CC1)c1cn(-c2ccc(F)cc2)c2ccc(cc12)-c1ccn(C)n1
InChI Key InChIKey=RWIIDELOEVNLPK-UHFFFAOYSA-N
Data  2 KI
  Tab Delimited (TSV)   2D SDfile   Computed 3D by Vconf -m prep SDfile
Find this compound or compounds like it in BindingDB:
Activity Spreadsheet -- Enzyme Inhibition Constant Data from BindingDB
Found 2 hits for monomerid = 50426620
TargetAlpha-1A adrenergic receptor(CALF)
H. Lundbeck
Curated by ChEMBL
LigandPNGBDBM50426620(CHEMBL2326176)
Affinity DataKi:  0.540nM. Assay description: Displacement of [3H]prazosine from bovine alpha1A adrenoceptor expressed in BHK cells after 20 mins by scintillation counting analysis
In DepthDetails ArticlePubMed
TargetD(2) dopamine receptor(Homo sapiens (Human))
H. Lundbeck
Curated by ChEMBL
LigandPNGBDBM50426620(CHEMBL2326176)
Affinity DataKi:  160nM. Assay description: Displacement of [3H]spiperone from human dopamine D2 receptor expressed in CHO cells after 30 mins by scintillation counting analysis
In DepthDetails ArticlePubMed