BDBM50426763 CHEMBL2322147
SMILES CC(C)(COc1ccc(cc1C#N)-c1cc(=O)[nH]c(N)n1)C(O)=O
InChI Key InChIKey=KONXOCLMILPJMO-UHFFFAOYSA-N
Data  1 IC50
  Tab Delimited (TSV)   2D SDfile   Computed 3D by Vconf -m prep SDfile
Find this compound or compounds like it in BindingDB:
Activity Spreadsheet -- Enzyme Inhibition Constant Data from BindingDB
Found 1 hit for monomerid = 50426763
TargetXanthine dehydrogenase/oxidase(Bos taurus (Bovine))
Piramal Healthcare
Curated by ChEMBL
LigandPNGBDBM50426763(CHEMBL2322147)
Affinity DataIC50:  5nM. Assay description: Inhibition of bovine xanthine oxidase-mediated uric acid production after 30 mins by spectrophotometric analysis
In DepthDetails ArticlePubMed