BDBM50426838 CHEMBL2323356
SMILES CCOc1ccc(\C=N\NC(=O)CN2CCC(Cc3ccccc3)CC2)cc1
InChI Key InChIKey=PZUITVNJLUHHRJ-JJIBRWJFSA-N
Data  3 KI  2 IC50
  Tab Delimited (TSV)   2D SDfile   Computed 3D by Vconf -m prep SDfile
Find this compound or compounds like it in BindingDB:
Activity Spreadsheet -- Enzyme Inhibition Constant Data from BindingDB
Found 5 hits for monomerid = 50426838
TargetCholinesterase(Equus caballus (Horse))
Baskent University
Curated by ChEMBL
LigandPNGBDBM50426838(CHEMBL2323356)
Affinity DataKi:  3.15E+4nM. Assay description: Competitive inhibition of equine BuChE by Lineweaver-Burk plot analysis
In DepthDetails ArticlePubMed
TargetAcetylcholinesterase(Homo sapiens (Human))
Baskent University
Curated by ChEMBL
LigandPNGBDBM50426838(CHEMBL2323356)
Affinity DataKi:  5.08E+4nM. Assay description: Uncompetitive inhibition of human recombinant AChE at 20 to 40 uM by Dixon plot analysis
In DepthDetails ArticlePubMed
TargetAcetylcholinesterase(Homo sapiens (Human))
Baskent University
Curated by ChEMBL
LigandPNGBDBM50426838(CHEMBL2323356)
Affinity DataKi:  8.38E+4nM. Assay description: Noncompetitive inhibition of human recombinant AChE at 60 to 100 uM by Dixon plot analysis
In DepthDetails ArticlePubMed
TargetAcetylcholinesterase(Homo sapiens (Human))
Baskent University
Curated by ChEMBL
LigandPNGBDBM50426838(CHEMBL2323356)
Affinity DataIC50:  5.31E+4nM. Assay description: Inhibition of human recombinant AChE measured for 1 min by Ellman's method
In DepthDetails ArticlePubMed
TargetCholinesterase(Equus caballus (Horse))
Baskent University
Curated by ChEMBL
LigandPNGBDBM50426838(CHEMBL2323356)
Affinity DataIC50:  6.73E+4nM. Assay description: Inhibition of equine BuChE measured for 1 min by Ellman's method
In DepthDetails ArticlePubMed