BDBM50427087 CHEMBL2322866
SMILES COc1cc(ccc1Cl)N1CCN(CC1)C(=O)Cn1nc(c(Cl)c1-c1ccccc1)C(F)(F)F
InChI Key InChIKey=MSYMTZAXOWPKOM-UHFFFAOYSA-N
Data  1 IC50
  Tab Delimited (TSV)   2D SDfile   Computed 3D by Vconf -m prep SDfile
Find this compound or compounds like it in BindingDB:
Activity Spreadsheet -- Enzyme Inhibition Constant Data from BindingDB
Found 1 hit for monomerid = 50427087
TargetC-C chemokine receptor type 1(Homo sapiens (Human))
Chemocentryx
Curated by ChEMBL
LigandPNGBDBM50427087(CHEMBL2322866)
Affinity DataIC50:  3.40E+3nM. Assay description: Displacement of [125I]-CCL3/MIP-1alpha from CCR1 in human THP1 cells
In DepthDetails ArticlePubMed